Reaction Details
TargetMitogen-activated protein kinase 14
LigandBDBM50314782
Substrate/Competitorn/a
Meas. Tech.ChEMBL_627007 (CHEMBL1103663)
Ki 0.6±n/a nM
Citation Pettus, LHWurz, RPXu, SHerberich, BHenkle, BLiu, QMcBride, HJMu, SPlant, MHSaris, CJSherman, LWong, LMChmait, SLee, MRMohr, CHsieh, FTasker, AS Discovery and evaluation of 7-alkyl-1,5-bis-aryl-pyrazolopyridinones as highly potent, selective, and orally efficacious inhibitors of p38alpha mitogen-activated protein kinase. J Med Chem53:2973-85 (2010) 
 
Mitogen-activated protein kinase 14
Name:Mitogen-activated protein kinase 14
Type:Serine/threonine-protein kinase
Mol. Mass.:41286.76
Organism:Homo sapiens (Human)
Description:Q16539
Residue:360
BDBM50314782
NameBDBM50314782
Synonyms:CHEMBL1089866 | N-Cyclopropyl-3-(1-(2,4-difluorophenyl)-7-ethyl-6-oxo-6,7-dihydro-1H-pyrazolo[3,4-b]pyridin-5-yl)-4-methylbenzamide
TypeSmall organic molecule
Emp. Form.C25H22F2N4O2
Mol. Mass.448.4646
SMILESCCn1c2n(ncc2cc(-c2cc(ccc2C)C(=O)NC2CC2)c1=O)-c1ccc(F)cc1F