Reaction Details
TargetThymidine kinase 2, mitochondrial
LigandBDBM50314836
Substrate/Competitorn/a
Meas. Tech.ChEMBL_627482 (CHEMBL1111768)
IC50 320±n/a nM
Citation Van Poecke, SNegri, AGago, FVan Daele, ISolaroli, NKarlsson, ABalzarini, JVan Calenbergh, S 3'-[4-Aryl-(1,2,3-triazol-1-yl)]-3'-deoxythymidine analogues as potent and selective inhibitors of human mitochondrial thymidine kinase. J Med Chem53:2902-12 (2010) 
 
Thymidine kinase 2, mitochondrial
Name:Thymidine kinase 2, mitochondrial
Type:PROTEIN
Mol. Mass.:31013.50
Organism:Homo sapiens (Human)
Description:ChEMBL_1333885
Residue:265
BDBM50314836
NameBDBM50314836
Synonyms:3'-(4-Phenyl-1,2,3-triazol-1-yl)-3'-deoxythymidine CHEMBL1090132
TypeSmall organic molecule
Emp. Form.C18H19N5O4
Mol. Mass.369.3746
SMILESCc1cn([C@H]2C[C@@H]([C@@H](CO)O2)n2cc(nn2)-c2ccccc2)c(=O)[nH]c1=O