Reaction Details
TargetThymidine kinase 2, mitochondrial
LigandBDBM50314838
Substrate/Competitorn/a
Meas. Tech.ChEMBL_627482 (CHEMBL1111768)
IC50 150±n/a nM
Citation Van Poecke, SNegri, AGago, FVan Daele, ISolaroli, NKarlsson, ABalzarini, JVan Calenbergh, S 3'-[4-Aryl-(1,2,3-triazol-1-yl)]-3'-deoxythymidine analogues as potent and selective inhibitors of human mitochondrial thymidine kinase. J Med Chem53:2902-12 (2010) 
 
Thymidine kinase 2, mitochondrial
Name:Thymidine kinase 2, mitochondrial
Type:PROTEIN
Mol. Mass.:31013.50
Organism:Homo sapiens (Human)
Description:ChEMBL_1333885
Residue:265
BDBM50314838
NameBDBM50314838
Synonyms:3'-(4-Cyclopentylmethyl-1,2,3-triazol-1-yl)-3'-deoxy-beta-D-thymidine | CHEMBL1090134
TypeSmall organic molecule
Emp. Form.C18H25N5O4
Mol. Mass.375.4222
SMILESCc1cn([C@H]2C[C@@H]([C@@H](CO)O2)n2cc(CC3CCCC3)nn2)c(=O)[nH]c1=O