Reaction Details
TargetAcetyl-CoA carboxylase 2
LigandBDBM50314930
Substrate/Competitorn/a
Meas. Tech.ChEMBL_627704 (CHEMBL1115284)
IC50 0.21±n/a nM
Citation Corbett, JWFreeman-Cook, KDElliott, RVajdos, FRajamohan, FKohls, DMarr, EZhang, HTong, LTu, MMurdande, SDoran, SDHouser, JASong, WJones, CJCoffey, SBBuzon, LMinich, MLDirico, KJTapley, SMcPherson, RKSugarman, EHarwood, HJEsler, W Discovery of small molecule isozyme non-specific inhibitors of mammalian acetyl-CoA carboxylase 1 and 2. Bioorg Med Chem Lett20:2383-8 (2010) 
 
Acetyl-CoA carboxylase 2
Name:Acetyl-CoA carboxylase 2
Type:Protein
Mol. Mass.:276535.21
Organism:Homo sapiens (Human)
Description:O00763
Residue:2458
BDBM50314930
NameBDBM50314930
Synonyms:1-(2-(1-methyl-1H-pyrazol-3-yl)-1H-benzo[d]imidazole-5-carbonyl)-6'-(1-methyl-1H-pyrazol-4-yl)spiro[piperidine-4,2'-pyrano[2,3-c]pyridin]-4'(3'H)-one | CHEMBL1089882
TypeSmall organic molecule
Emp. Form.C28H26N8O3
Mol. Mass.522.5578
SMILESCn1ccc(n1)-c1nc2ccc(cc2[nH]1)C(=O)N1CCC2(CC1)CC(=O)c1cc(ncc1O2)-c1cnn(C)c1