Reaction Details
TargetAcetyl-CoA carboxylase 1
LigandBDBM50314931
Substrate/Competitorn/a
Meas. Tech.ChEMBL_627703 (CHEMBL1115283)
IC50 24.6±n/a nM
Citation Corbett, JWFreeman-Cook, KDElliott, RVajdos, FRajamohan, FKohls, DMarr, EZhang, HTong, LTu, MMurdande, SDoran, SDHouser, JASong, WJones, CJCoffey, SBBuzon, LMinich, MLDirico, KJTapley, SMcPherson, RKSugarman, EHarwood, HJEsler, W Discovery of small molecule isozyme non-specific inhibitors of mammalian acetyl-CoA carboxylase 1 and 2. Bioorg Med Chem Lett20:2383-8 (2010) 
 
Acetyl-CoA carboxylase 1
Name:Acetyl-CoA carboxylase 1
Type:Protein
Mol. Mass.:265183.92
Organism:Rattus norvegicus (Rat)
Description:P11497
Residue:2345
BDBM50314931
NameBDBM50314931
Synonyms:1-(7-methyl-1H-indazole-5-carbonyl)-6'-(1-methyl-1H-pyrazol-4-yl)spiro[piperidine-4,2'-pyrano[2,3-c]pyridin]-4'(3'H)-one | CHEMBL1089883
TypeSmall organic molecule
Emp. Form.C25H24N6O3
Mol. Mass.456.4965
SMILESCc1cc(cc2cn[nH]c12)C(=O)N1CCC2(CC1)CC(=O)c1cc(ncc1O2)-c1cnn(C)c1