Reaction Details
TargetAcetyl-CoA carboxylase 1
LigandBDBM50314943
Substrate/Competitorn/a
Meas. Tech.ChEMBL_627703 (CHEMBL1115283)
IC50 12±n/a nM
Citation Corbett, JWFreeman-Cook, KDElliott, RVajdos, FRajamohan, FKohls, DMarr, EZhang, HTong, LTu, MMurdande, SDoran, SDHouser, JASong, WJones, CJCoffey, SBBuzon, LMinich, MLDirico, KJTapley, SMcPherson, RKSugarman, EHarwood, HJEsler, W Discovery of small molecule isozyme non-specific inhibitors of mammalian acetyl-CoA carboxylase 1 and 2. Bioorg Med Chem Lett20:2383-8 (2010) 
 
Acetyl-CoA carboxylase 1
Name:Acetyl-CoA carboxylase 1
Type:Protein
Mol. Mass.:265183.92
Organism:Rattus norvegicus (Rat)
Description:P11497
Residue:2345
BDBM50314943
NameBDBM50314943
Synonyms:1-(3,7-dimethyl-1H-indazole-5-carbonyl)-5'-isopropoxyspiro[piperidine-4,2'-pyrano[3,2-c]pyridin]-4'(3'H)-one | CHEMBL1090200
TypeSmall organic molecule
Emp. Form.C25H28N4O4
Mol. Mass.448.5142
SMILESCC(C)Oc1nccc2OC3(CCN(CC3)C(=O)c3cc(C)c4[nH]nc(C)c4c3)CC(=O)c12