Reaction Details
TargetEpidermal growth factor receptor
LigandBDBM50314989
Substrate/Competitorn/a
Meas. Tech.ChEMBL_624184 (CHEMBL1105216)
IC50 19±n/a nM
Citation Pawar, VGSos, MLRode, HBRabiller, MHeynck, Svan Otterlo, WAThomas, RKRauh, D Synthesis and biological evaluation of 4-anilinoquinolines as potent inhibitors of epidermal growth factor receptor. J Med Chem53:2892-901 (2010) 
 
Epidermal growth factor receptor
Name:Epidermal growth factor receptor
Type:Receptor Kinase Domain
Mol. Mass.:134279.59
Organism:Homo sapiens (Human)
Description:P00533
Residue:1210
BDBM50314989
NameBDBM50314989
Synonyms:CHEMBL1092250 | N-(3-Ethynylphenyl)-6,7-dimethoxyquinolin-4-amine
TypeSmall organic molecule
Emp. Form.C19H16N2O2
Mol. Mass.304.3425
SMILESCOc1cc2nccc(Nc3cccc(c3)C#C)c2cc1OC