Reaction Details
TargetBeta-secretase 1
LigandBDBM50315011
Substrate/Competitorn/a
Meas. Tech.ChEMBL_624424 (CHEMBL1108752)
IC50 810±n/a nM
Citation Malamas, MSBarnes, KHui, YJohnson, MLovering, FCondon, JFobare, WSolvibile, WTurner, JHu, YManas, ESFan, KOlland, AChopra, RBard, JPangalos, MNReinhart, PRobichaud, AJ Novel pyrrolyl 2-aminopyridines as potent and selective human beta-secretase (BACE1) inhibitors. Bioorg Med Chem Lett20:2068-73 (2010) 
 
Beta-secretase 1
Name:Beta-secretase 1
Type:Protein
Mol. Mass.:55755.10
Organism:Homo sapiens (Human)
Description:P56817
Residue:501
BDBM50315011
NameBDBM50315011
Synonyms:6-((2-(2-chlorophenyl)-5-(4-(pyridin-2-yloxy)phenyl)-1H-pyrrol-1-yl)methyl)pyridin-2-amine | CHEMBL1091592
TypeSmall organic molecule
Emp. Form.C27H21ClN4O
Mol. Mass.452.935
SMILESNc1cccc(Cn2c(ccc2-c2ccccc2Cl)-c2ccc(Oc3ccccn3)cc2)n1