Reaction Details
TargetBeta-secretase 1
LigandBDBM50314998
Substrate/Competitorn/a
Meas. Tech.ChEMBL_624424 (CHEMBL1108752)
IC50 290±n/a nM
Citation Malamas, MSBarnes, KHui, YJohnson, MLovering, FCondon, JFobare, WSolvibile, WTurner, JHu, YManas, ESFan, KOlland, AChopra, RBard, JPangalos, MNReinhart, PRobichaud, AJ Novel pyrrolyl 2-aminopyridines as potent and selective human beta-secretase (BACE1) inhibitors. Bioorg Med Chem Lett20:2068-73 (2010) 
 
Beta-secretase 1
Name:Beta-secretase 1
Type:Protein
Mol. Mass.:55755.10
Organism:Homo sapiens (Human)
Description:P56817
Residue:501
BDBM50314998
NameBDBM50314998
Synonyms:6-((2-(2-chlorophenyl)-5-(4-(thiophen-2-yloxy)phenyl)-1H-pyrrol-1-yl)methyl)pyridin-2-amine | CHEMBL1092913
TypeSmall organic molecule
Emp. Form.C26H20ClN3OS
Mol. Mass.457.975
SMILESNc1cccc(Cn2c(ccc2-c2ccccc2Cl)-c2ccc(Oc3cccs3)cc2)n1