Reaction Details
TargetBeta-secretase 1
LigandBDBM50315004
Substrate/Competitorn/a
Meas. Tech.ChEMBL_624424 (CHEMBL1108752)
IC50 420±n/a nM
Citation Malamas, MSBarnes, KHui, YJohnson, MLovering, FCondon, JFobare, WSolvibile, WTurner, JHu, YManas, ESFan, KOlland, AChopra, RBard, JPangalos, MNReinhart, PRobichaud, AJ Novel pyrrolyl 2-aminopyridines as potent and selective human beta-secretase (BACE1) inhibitors. Bioorg Med Chem Lett20:2068-73 (2010) 
 
Beta-secretase 1
Name:Beta-secretase 1
Type:Protein
Mol. Mass.:55755.10
Organism:Homo sapiens (Human)
Description:P56817
Residue:501
BDBM50315004
NameBDBM50315004
Synonyms:4-(4-(1-((6-aminopyridin-2-yl)methyl)-5-(2-chlorophenyl)-1H-pyrrol-2-yl)phenoxy)butanenitrile CHEMBL1089137
TypeSmall organic molecule
Emp. Form.C26H23ClN4O
Mol. Mass.442.94
SMILESNc1cccc(Cn2c(ccc2-c2ccccc2Cl)-c2ccc(OCCCC#N)cc2)n1