Reaction Details
TargetBeta-secretase 1
LigandBDBM50315013
Substrate/Competitorn/a
Meas. Tech.ChEMBL_624424 (CHEMBL1108752)
IC50 3400±n/a nM
Citation Malamas, MSBarnes, KHui, YJohnson, MLovering, FCondon, JFobare, WSolvibile, WTurner, JHu, YManas, ESFan, KOlland, AChopra, RBard, JPangalos, MNReinhart, PRobichaud, AJ Novel pyrrolyl 2-aminopyridines as potent and selective human beta-secretase (BACE1) inhibitors. Bioorg Med Chem Lett20:2068-73 (2010) 
 
Beta-secretase 1
Name:Beta-secretase 1
Type:Protein
Mol. Mass.:55755.10
Organism:Homo sapiens (Human)
Description:P56817
Residue:501
BDBM50315013
NameBDBM50315013
Synonyms:4-(1-((6-aminopyridin-2-yl)methyl)-5-phenyl-1H-pyrrol-2-yl)-N-cyclobutylbenzamide | CHEMBL1093121
TypeSmall organic molecule
Emp. Form.C27H26N4O
Mol. Mass.422.5215
SMILESNc1cccc(Cn2c(ccc2-c2ccc(cc2)C(=O)NC2CCC2)-c2ccccc2)n1