Reaction Details
TargetBeta-secretase 1
LigandBDBM50315003
Substrate/Competitorn/a
Meas. Tech.ChEMBL_624424 (CHEMBL1108752)
IC50 590±n/a nM
Citation Malamas, MSBarnes, KHui, YJohnson, MLovering, FCondon, JFobare, WSolvibile, WTurner, JHu, YManas, ESFan, KOlland, AChopra, RBard, JPangalos, MNReinhart, PRobichaud, AJ Novel pyrrolyl 2-aminopyridines as potent and selective human beta-secretase (BACE1) inhibitors. Bioorg Med Chem Lett20:2068-73 (2010) 
 
Beta-secretase 1
Name:Beta-secretase 1
Type:Protein
Mol. Mass.:55755.10
Organism:Homo sapiens (Human)
Description:P56817
Residue:501
BDBM50315003
NameBDBM50315003
Synonyms:CHEMBL1092227 | N-allyl-4-(1-((6-aminopyridin-2-yl)methyl)-5-phenyl-1H-pyrrol-2-yl)benzamide
TypeSmall organic molecule
Emp. Form.C26H24N4O
Mol. Mass.408.495
SMILESNc1cccc(Cn2c(ccc2-c2ccc(cc2)C(=O)NCC=C)-c2ccccc2)n1