Reaction Details
TargetAmyloid-beta precursor protein
LigandBDBM50315006
Substrate/Competitorn/a
Meas. Tech.ChEMBL_624431 (CHEMBL1108759)
EC50 16000±n/a nM
Citation Malamas, MSBarnes, KHui, YJohnson, MLovering, FCondon, JFobare, WSolvibile, WTurner, JHu, YManas, ESFan, KOlland, AChopra, RBard, JPangalos, MNReinhart, PRobichaud, AJ Novel pyrrolyl 2-aminopyridines as potent and selective human beta-secretase (BACE1) inhibitors. Bioorg Med Chem Lett20:2068-73 (2010) 
 
Amyloid-beta precursor protein
Name:Amyloid-beta precursor protein
Type:Single-pass type I membrane protein
Mol. Mass.:86890.41
Organism:Homo sapiens (Human)
Description:P05067
Residue:770
BDBM50315006
NameBDBM50315006
Synonyms:6-((2-(2-chlorophenyl)-5-(4-methoxyphenyl)-1H-pyrrol-1-yl)methyl)pyridin-2-amine | CHEMBL1093152
TypeSmall organic molecule
Emp. Form.C23H20ClN3O
Mol. Mass.389.877
SMILESCOc1ccc(cc1)-c1ccc(-c2ccccc2Cl)n1Cc1cccc(N)n1