Reaction Details
TargetAmyloid-beta precursor protein
LigandBDBM50315007
Substrate/Competitorn/a
Meas. Tech.ChEMBL_624431 (CHEMBL1108759)
EC50 15400±n/a nM
Citation Malamas, MSBarnes, KHui, YJohnson, MLovering, FCondon, JFobare, WSolvibile, WTurner, JHu, YManas, ESFan, KOlland, AChopra, RBard, JPangalos, MNReinhart, PRobichaud, AJ Novel pyrrolyl 2-aminopyridines as potent and selective human beta-secretase (BACE1) inhibitors. Bioorg Med Chem Lett20:2068-73 (2010) 
 
Amyloid-beta precursor protein
Name:Amyloid-beta precursor protein
Type:Single-pass type I membrane protein
Mol. Mass.:86890.41
Organism:Homo sapiens (Human)
Description:P05067
Residue:770
BDBM50315007
NameBDBM50315007
Synonyms:6-((2,5-diphenyl-1H-pyrrol-1-yl)methyl)pyridin-2-amine | CHEMBL1092879
TypeSmall organic molecule
Emp. Form.C22H19N3
Mol. Mass.325.4064
SMILESNc1cccc(Cn2c(ccc2-c2ccccc2)-c2ccccc2)n1