Reaction Details
TargetCathepsin D
LigandBDBM50315003
Substrate/Competitorn/a
Meas. Tech.ChEMBL_624430 (CHEMBL1108758)
IC50 43600±n/a nM
Citation Malamas, MSBarnes, KHui, YJohnson, MLovering, FCondon, JFobare, WSolvibile, WTurner, JHu, YManas, ESFan, KOlland, AChopra, RBard, JPangalos, MNReinhart, PRobichaud, AJ Novel pyrrolyl 2-aminopyridines as potent and selective human beta-secretase (BACE1) inhibitors. Bioorg Med Chem Lett20:2068-73 (2010) 
 
Cathepsin D
Name:Cathepsin D
Type:Enzyme
Mol. Mass.:44551.72
Organism:Homo sapiens (Human)
Description:Human proCathepsin D (SwissProt accession number P07339) was expressed in Sf9 cells, purified, and autoactivated.
Residue:412
BDBM50315003
NameBDBM50315003
Synonyms:CHEMBL1092227 | N-allyl-4-(1-((6-aminopyridin-2-yl)methyl)-5-phenyl-1H-pyrrol-2-yl)benzamide
TypeSmall organic molecule
Emp. Form.C26H24N4O
Mol. Mass.408.495
SMILESNc1cccc(Cn2c(ccc2-c2ccc(cc2)C(=O)NCC=C)-c2ccccc2)n1