Reaction Details
TargetSerine/threonine-protein kinase mTOR
LigandBDBM50315049
Substrate/Competitorn/a
Meas. Tech.ChEMBL_624459 (CHEMBL1108787)
IC50 1±n/a nM
Citation Verheijen, JCRichard, DJCurran, KKaplan, JYu, KZask, A 2-Arylureidophenyl-4-(3-oxa-8-azabicyclo[3.2.1]octan-8-yl)triazines as highly potent and selective ATP competitive mTOR inhibitors: optimization of human microsomal stability. Bioorg Med Chem Lett20:2648-53 (2010) 
 
Serine/threonine-protein kinase mTOR
Name:Serine/threonine-protein kinase mTOR
Type:Rapamycin target protein
Mol. Mass.:288917.12
Organism:Homo sapiens (Human)
Description:P42345
Residue:2549
BDBM50315049
NameBDBM50315049
Synonyms:1-(4-(4,6-di(3-oxa-8-azabicyclo[3.2.1]octan-8-yl)-1,3,5-triazin-2-yl)phenyl)-3-(4-((4-methylpiperazin-1-yl)methyl)phenyl)urea | CHEMBL1092392
TypeSmall organic molecule
Emp. Form.C34H43N9O3
Mol. Mass.625.7637
SMILESCN1CCN(Cc2ccc(NC(=O)Nc3ccc(cc3)-c3nc(nc(n3)N3C4CCC3COC4)N3C4CCC3COC4)cc2)CC1