Reaction Details
TargetSerine/threonine-protein kinase mTOR
LigandBDBM50315053
Substrate/Competitorn/a
Meas. Tech.ChEMBL_624459 (CHEMBL1108787)
IC50 0.90±n/a nM
Citation Verheijen, JCRichard, DJCurran, KKaplan, JYu, KZask, A 2-Arylureidophenyl-4-(3-oxa-8-azabicyclo[3.2.1]octan-8-yl)triazines as highly potent and selective ATP competitive mTOR inhibitors: optimization of human microsomal stability. Bioorg Med Chem Lett20:2648-53 (2010) 
 
Serine/threonine-protein kinase mTOR
Name:Serine/threonine-protein kinase mTOR
Type:Rapamycin target protein
Mol. Mass.:288917.12
Organism:Homo sapiens (Human)
Description:P42345
Residue:2549
BDBM50315053
NameBDBM50315053
Synonyms:1-(4-(4,6-di(3-oxa-8-azabicyclo[3.2.1]octan-8-yl)-1,3,5-triazin-2-yl)phenyl)-3-(4-(2-(4-methylpiperazin-1-yl)ethoxy)phenyl)urea | CHEMBL1092396
TypeSmall organic molecule
Emp. Form.C35H45N9O4
Mol. Mass.655.7897
SMILESCN1CCN(CCOc2ccc(NC(=O)Nc3ccc(cc3)-c3nc(nc(n3)N3C4CCC3COC4)N3C4CCC3COC4)cc2)CC1