Reaction Details
TargetSerine/threonine-protein kinase mTOR
LigandBDBM50315054
Substrate/Competitorn/a
Meas. Tech.ChEMBL_624459 (CHEMBL1108787)
IC50 0.80±n/a nM
Citation Verheijen, JCRichard, DJCurran, KKaplan, JYu, KZask, A 2-Arylureidophenyl-4-(3-oxa-8-azabicyclo[3.2.1]octan-8-yl)triazines as highly potent and selective ATP competitive mTOR inhibitors: optimization of human microsomal stability. Bioorg Med Chem Lett20:2648-53 (2010) 
 
Serine/threonine-protein kinase mTOR
Name:Serine/threonine-protein kinase mTOR
Type:Rapamycin target protein
Mol. Mass.:288917.12
Organism:Homo sapiens (Human)
Description:P42345
Residue:2549
BDBM50315054
NameBDBM50315054
Synonyms:1-(4-(4,6-di(3-oxa-8-azabicyclo[3.2.1]octan-8-yl)-1,3,5-triazin-2-yl)phenyl)-3-(4-(2-(pyrrolidin-1-yl)ethoxy)phenyl)urea | CHEMBL1092397
TypeSmall organic molecule
Emp. Form.C34H42N8O4
Mol. Mass.626.7485
SMILESO=C(Nc1ccc(OCCN2CCCC2)cc1)Nc1ccc(cc1)-c1nc(nc(n1)N1C2CCC1COC2)N1C2CCC1COC2