Reaction Details
TargetSerine/threonine-protein kinase mTOR
LigandBDBM50315059
Substrate/Competitorn/a
Meas. Tech.ChEMBL_624459 (CHEMBL1108787)
IC50 6.6±n/a nM
Citation Verheijen, JCRichard, DJCurran, KKaplan, JYu, KZask, A 2-Arylureidophenyl-4-(3-oxa-8-azabicyclo[3.2.1]octan-8-yl)triazines as highly potent and selective ATP competitive mTOR inhibitors: optimization of human microsomal stability. Bioorg Med Chem Lett20:2648-53 (2010) 
 
Serine/threonine-protein kinase mTOR
Name:Serine/threonine-protein kinase mTOR
Type:Rapamycin target protein
Mol. Mass.:288917.12
Organism:Homo sapiens (Human)
Description:P42345
Residue:2549
BDBM50315059
NameBDBM50315059
Synonyms:1-(4-(4-(3-oxa-8-azabicyclo[3.2.1]octan-8-yl)-6-(isopropyl(methyl)amino)-1,3,5-triazin-2-yl)phenyl)-3-(4-(4-methylpiperazin-1-yl)phenyl)urea | CHEMBL1091346
TypeSmall organic molecule
Emp. Form.C31H41N9O2
Mol. Mass.571.7163
SMILESCC(C)N(C)c1nc(nc(n1)-c1ccc(NC(=O)Nc2ccc(cc2)N2CCN(C)CC2)cc1)N1C2CCC1COC2