Reaction Details
TargetSerine/threonine-protein kinase mTOR
LigandBDBM50315079
Substrate/Competitorn/a
Meas. Tech.ChEMBL_624459 (CHEMBL1108787)
IC50 0.25±n/a nM
Citation Verheijen, JCRichard, DJCurran, KKaplan, JYu, KZask, A 2-Arylureidophenyl-4-(3-oxa-8-azabicyclo[3.2.1]octan-8-yl)triazines as highly potent and selective ATP competitive mTOR inhibitors: optimization of human microsomal stability. Bioorg Med Chem Lett20:2648-53 (2010) 
 
Serine/threonine-protein kinase mTOR
Name:Serine/threonine-protein kinase mTOR
Type:Rapamycin target protein
Mol. Mass.:288917.12
Organism:Homo sapiens (Human)
Description:P42345
Residue:2549
BDBM50315079
NameBDBM50315079
Synonyms:1-(4-(4-(3-oxa-8-azabicyclo[3.2.1]octan-8-yl)-6-((R)-3-methylmorpholino)-1,3,5-triazin-2-yl)phenyl)-3-(4-(4-(dimethylamino)piperidine-1-carbonyl)phenyl)urea | CHEMBL1092389
TypeSmall organic molecule
Emp. Form.C35H45N9O4
Mol. Mass.655.7897
SMILESC[C@@H]1COCCN1c1nc(nc(n1)-c1ccc(NC(=O)Nc2ccc(cc2)C(=O)N2CCC(CC2)N(C)C)cc1)N1C2CCC1COC2