Reaction Details
TargetPhosphatidylinositol 4,5-bisphosphate 3-kinase catalytic subunit alpha isoform
LigandBDBM50315057
Substrate/Competitorn/a
Meas. Tech.ChEMBL_624460 (CHEMBL1108788)
IC50 1028±n/a nM
Citation Verheijen, JCRichard, DJCurran, KKaplan, JYu, KZask, A 2-Arylureidophenyl-4-(3-oxa-8-azabicyclo[3.2.1]octan-8-yl)triazines as highly potent and selective ATP competitive mTOR inhibitors: optimization of human microsomal stability. Bioorg Med Chem Lett20:2648-53 (2010) 
 
Phosphatidylinositol 4,5-bisphosphate 3-kinase catalytic subunit alpha isoform
Name:Phosphatidylinositol 4,5-bisphosphate 3-kinase catalytic subunit alpha isoform
Type:Enzyme Subunit
Mol. Mass.:124294.87
Organism:Homo sapiens (Human)
Description:P42336
Residue:1068
BDBM50315057
NameBDBM50315057
Synonyms:1-(4-(4-(3-oxa-8-azabicyclo[3.2.1]octan-8-yl)-6-((2S,5R)-2,5-bis(hydroxymethyl)pyrrolidin-1-yl)-1,3,5-triazin-2-yl)phenyl)-3-(4-(4-methylpiperazin-1-yl)phenyl)urea | CHEMBL1091344
TypeSmall organic molecule
Emp. Form.C33H43N9O4
Mol. Mass.629.7524
SMILESCN1CCN(CC1)c1ccc(NC(=O)Nc2ccc(cc2)-c2nc(nc(n2)N2C3CCC2COC3)N2[C@@H](CO)CC[C@H]2CO)cc1