Reaction Details
TargetPhosphatidylinositol 4,5-bisphosphate 3-kinase catalytic subunit alpha isoform
LigandBDBM50315064
Substrate/Competitorn/a
Meas. Tech.ChEMBL_624460 (CHEMBL1108788)
IC50 294±n/a nM
Citation Verheijen, JCRichard, DJCurran, KKaplan, JYu, KZask, A 2-Arylureidophenyl-4-(3-oxa-8-azabicyclo[3.2.1]octan-8-yl)triazines as highly potent and selective ATP competitive mTOR inhibitors: optimization of human microsomal stability. Bioorg Med Chem Lett20:2648-53 (2010) 
 
Phosphatidylinositol 4,5-bisphosphate 3-kinase catalytic subunit alpha isoform
Name:Phosphatidylinositol 4,5-bisphosphate 3-kinase catalytic subunit alpha isoform
Type:Enzyme Subunit
Mol. Mass.:124294.87
Organism:Homo sapiens (Human)
Description:P42336
Residue:1068
BDBM50315064
NameBDBM50315064
Synonyms:1-(4-(4-(3-oxa-8-azabicyclo[3.2.1]octan-8-yl)-6-(tetrahydro-2H-pyran-4-yl)-1,3,5-triazin-2-yl)phenyl)-3-(4-(piperazin-1-yl)phenyl)urea | CHEMBL1091351
TypeSmall organic molecule
Emp. Form.C31H38N8O3
Mol. Mass.570.6852
SMILESO=C(Nc1ccc(cc1)N1CCNCC1)Nc1ccc(cc1)-c1nc(nc(n1)N1C2CCC1COC2)C1CCOCC1