Reaction Details
TargetPhosphatidylinositol 4,5-bisphosphate 3-kinase catalytic subunit alpha isoform
LigandBDBM50315085
Substrate/Competitorn/a
Meas. Tech.ChEMBL_624710 (CHEMBL1112502)
IC50 314±n/a nM
Citation Richard, DJVerheijen, JCYu, KZask, A Triazines incorporating (R)-3-methylmorpholine are potent inhibitors of the mammalian target of rapamycin (mTOR) with selectivity over PI3Kalpha. Bioorg Med Chem Lett20:2654-7 (2010) 
 
Phosphatidylinositol 4,5-bisphosphate 3-kinase catalytic subunit alpha isoform
Name:Phosphatidylinositol 4,5-bisphosphate 3-kinase catalytic subunit alpha isoform
Type:Enzyme Subunit
Mol. Mass.:124294.87
Organism:Homo sapiens (Human)
Description:P42336
Residue:1068
BDBM50315085
NameBDBM50315085
Synonyms:1-(4-(4,6-bis((R)-3-methylmorpholino)-1,3,5-triazin-2-yl)phenyl)-3-(4-(2-(dimethylamino)ethoxy)phenyl)urea | CHEMBL1092037
TypeSmall organic molecule
Emp. Form.C30H40N8O4
Mol. Mass.576.6898
SMILESC[C@@H]1COCCN1c1nc(nc(n1)-c1ccc(NC(=O)Nc2ccc(OCCN(C)C)cc2)cc1)N1CCOC[C@H]1C