Reaction Details
TargetSerine/threonine-protein kinase mTOR
LigandBDBM50315087
Substrate/Competitorn/a
Meas. Tech.ChEMBL_624711 (CHEMBL1112503)
IC50 0.50±n/a nM
Citation Richard, DJVerheijen, JCYu, KZask, A Triazines incorporating (R)-3-methylmorpholine are potent inhibitors of the mammalian target of rapamycin (mTOR) with selectivity over PI3Kalpha. Bioorg Med Chem Lett20:2654-7 (2010) 
 
Serine/threonine-protein kinase mTOR
Name:Serine/threonine-protein kinase mTOR
Type:PROTEIN
Mol. Mass.:288819.88
Organism:Rattus norvegicus
Description:ChEMBL_1460639
Residue:2549
BDBM50315087
NameBDBM50315087
Synonyms:1-(4-(4,6-bis((R)-3-methylmorpholino)-1,3,5-triazin-2-yl)phenyl)-3-(4-(4-(dimethylamino)piperidine-1-carbonyl)phenyl)urea | CHEMBL1092039
TypeSmall organic molecule
Emp. Form.C34H45N9O4
Mol. Mass.643.779
SMILESC[C@@H]1COCCN1c1nc(nc(n1)-c1ccc(NC(=O)Nc2ccc(cc2)C(=O)N2CCC(CC2)N(C)C)cc1)N1CCOC[C@H]1C