Reaction Details
TargetPhosphatidylinositol 4,5-bisphosphate 3-kinase catalytic subunit alpha isoform
LigandBDBM50315098
Substrate/Competitorn/a
Meas. Tech.ChEMBL_624710 (CHEMBL1112502)
IC50 846±n/a nM
Citation Richard, DJVerheijen, JCYu, KZask, A Triazines incorporating (R)-3-methylmorpholine are potent inhibitors of the mammalian target of rapamycin (mTOR) with selectivity over PI3Kalpha. Bioorg Med Chem Lett20:2654-7 (2010) 
 
Phosphatidylinositol 4,5-bisphosphate 3-kinase catalytic subunit alpha isoform
Name:Phosphatidylinositol 4,5-bisphosphate 3-kinase catalytic subunit alpha isoform
Type:Enzyme Subunit
Mol. Mass.:124294.87
Organism:Homo sapiens (Human)
Description:P42336
Residue:1068
BDBM50315098
NameBDBM50315098
Synonyms:1-(4-(4,6-bis((R)-3-methylmorpholino)-1,3,5-triazin-2-yl)phenyl)-3-(6-(4-methylpiperazin-1-yl)pyridin-3-yl)urea | CHEMBL1092034
TypeSmall organic molecule
Emp. Form.C30H40N10O3
Mol. Mass.588.7038
SMILESC[C@@H]1COCCN1c1nc(nc(n1)-c1ccc(NC(=O)Nc2ccc(nc2)N2CCN(C)CC2)cc1)N1CCOC[C@H]1C