Reaction Details
TargetSerine/threonine-protein kinase mTOR
LigandBDBM50315099
Substrate/Competitorn/a
Meas. Tech.ChEMBL_624711 (CHEMBL1112503)
IC50 1.1±n/a nM
Citation Richard, DJVerheijen, JCYu, KZask, A Triazines incorporating (R)-3-methylmorpholine are potent inhibitors of the mammalian target of rapamycin (mTOR) with selectivity over PI3Kalpha. Bioorg Med Chem Lett20:2654-7 (2010) 
 
Serine/threonine-protein kinase mTOR
Name:Serine/threonine-protein kinase mTOR
Type:PROTEIN
Mol. Mass.:288819.88
Organism:Rattus norvegicus
Description:ChEMBL_1460639
Residue:2549
BDBM50315099
NameBDBM50315099
Synonyms:1-(4-(4,6-bis((R)-3-methylmorpholino)-1,3,5-triazin-2-yl)phenyl)-3-(4-(4-methylpiperazin-1-yl)phenyl)urea | CHEMBL1092035
TypeSmall organic molecule
Emp. Form.C31H41N9O3
Mol. Mass.587.7157
SMILESC[C@@H]1COCCN1c1nc(nc(n1)-c1ccc(NC(=O)Nc2ccc(cc2)N2CCN(C)CC2)cc1)N1CCOC[C@H]1C