Reaction Details
TargetMitogen-activated protein kinase 14
LigandBDBM50315120
Substrate/Competitorn/a
Meas. Tech.ChEMBL_624923 (CHEMBL1107046)
IC50 19±n/a nM
Citation Walker, JKSelness, SRDevraj, RVHepperle, MENaing, WShieh, HKurambail, RYang, SFlynn, DLBenson, AGMessing, DMDice, TKim, TLindmark, RJMonahan, JBPortanova, J Identification of SD-0006, a potent diaryl pyrazole inhibitor of p38 MAP kinase. Bioorg Med Chem Lett20:2634-8 (2010) 
 
Mitogen-activated protein kinase 14
Name:Mitogen-activated protein kinase 14
Type:Serine/threonine-protein kinase
Mol. Mass.:41286.76
Organism:Homo sapiens (Human)
Description:Q16539
Residue:360
BDBM50315120
NameBDBM50315120
Synonyms:(1S,2S)-2-(4-(3-(4-chlorophenyl)-4-(pyrimidin-4-yl)-1H-pyrazol-5-yl)piperidin-1-yl)cyclopentanol | CHEMBL1089172
TypeSmall organic molecule
Emp. Form.C23H26ClN5O
Mol. Mass.423.938
SMILESO[C@H]1CCC[C@@H]1N1CCC(CC1)c1[nH]nc(c1-c1ccncn1)-c1ccc(Cl)cc1