Reaction Details
TargetMelatonin receptor type 1A
LigandBDBM50315170
Substrate/Competitorn/a
Meas. Tech.ChEMBL_624959 (CHEMBL1107082)
Ki 1840±n/a nM
Citation Hu, YHo, MKChan, KHNew, DCWong, YH Synthesis of substituted N-[3-(3-methoxyphenyl)propyl] amides as highly potent MT(2)-selective melatonin ligands. Bioorg Med Chem Lett20:2582-5 (2010) 
 
Melatonin receptor type 1A
Name:Melatonin receptor type 1A
Type:Enzyme
Mol. Mass.:39392.94
Organism:Homo sapiens (Human)
Description:P48039
Residue:350
BDBM50315170
NameBDBM50315170
Synonyms:CHEMBL1091716 | N-(3-(5-methoxy-2-(pyridin-2-ylmethoxy)phenyl)propyl)acetamide
TypeSmall organic molecule
Emp. Form.C18H22N2O3
Mol. Mass.314.3789
SMILESCOc1ccc(OCc2ccccn2)c(CCCNC(C)=O)c1