Reaction Details
TargetMelatonin receptor type 1A
LigandBDBM50315173
Substrate/Competitorn/a
Meas. Tech.ChEMBL_624959 (CHEMBL1107082)
Ki 2010±n/a nM
Citation Hu, YHo, MKChan, KHNew, DCWong, YH Synthesis of substituted N-[3-(3-methoxyphenyl)propyl] amides as highly potent MT(2)-selective melatonin ligands. Bioorg Med Chem Lett20:2582-5 (2010) 
 
Melatonin receptor type 1A
Name:Melatonin receptor type 1A
Type:Enzyme
Mol. Mass.:39392.94
Organism:Homo sapiens (Human)
Description:P48039
Residue:350
BDBM50315173
NameBDBM50315173
Synonyms:CHEMBL1092911 | N-(3-(4-(benzyloxy)-3-methoxyphenyl)propyl)propionamide
TypeSmall organic molecule
Emp. Form.C20H25NO3
Mol. Mass.327.4174
SMILESCCC(=O)NCCCc1ccc(OCc2ccccc2)c(OC)c1