Reaction Details
TargetMelatonin receptor type 1B
LigandBDBM50315179
Substrate/Competitorn/a
Meas. Tech.ChEMBL_624960 (CHEMBL1107083)
Ki 2300±n/a nM
Citation Hu, YHo, MKChan, KHNew, DCWong, YH Synthesis of substituted N-[3-(3-methoxyphenyl)propyl] amides as highly potent MT(2)-selective melatonin ligands. Bioorg Med Chem Lett20:2582-5 (2010) 
 
Melatonin receptor type 1B
Name:Melatonin receptor type 1B
Type:Enzyme
Mol. Mass.:40203.54
Organism:Homo sapiens (Human)
Description:P49286
Residue:362
BDBM50315179
NameBDBM50315179
Synonyms:CHEMBL1088826 | N-(3-(2-(benzyloxy)-5-methoxyphenyl)propyl)benzamide
TypeSmall organic molecule
Emp. Form.C24H25NO3
Mol. Mass.375.4602
SMILESCOc1ccc(OCc2ccccc2)c(CCCNC(=O)c2ccccc2)c1