Reaction Details
TargetMelatonin receptor type 1B
LigandBDBM50315181
Substrate/Competitorn/a
Meas. Tech.ChEMBL_624960 (CHEMBL1107083)
Ki 72.2±n/a nM
Citation Hu, YHo, MKChan, KHNew, DCWong, YH Synthesis of substituted N-[3-(3-methoxyphenyl)propyl] amides as highly potent MT(2)-selective melatonin ligands. Bioorg Med Chem Lett20:2582-5 (2010) 
 
Melatonin receptor type 1B
Name:Melatonin receptor type 1B
Type:Enzyme
Mol. Mass.:40203.54
Organism:Homo sapiens (Human)
Description:P49286
Residue:362
BDBM50315181
NameBDBM50315181
Synonyms:CHEMBL1091896 | N-(3-(5-methoxy-2-(3-phenylpropoxy)phenyl)propyl)acetamide
TypeSmall organic molecule
Emp. Form.C21H27NO3
Mol. Mass.341.444
SMILESCOc1ccc(OCCCc2ccccc2)c(CCCNC(C)=O)c1