Reaction Details
TargetMelatonin receptor type 1A
LigandBDBM50049516
Substrate/Competitorn/a
Meas. Tech.ChEMBL_624959 (CHEMBL1107082)
Ki 23.3±n/a nM
Citation Hu, YHo, MKChan, KHNew, DCWong, YH Synthesis of substituted N-[3-(3-methoxyphenyl)propyl] amides as highly potent MT(2)-selective melatonin ligands. Bioorg Med Chem Lett20:2582-5 (2010) 
 
Melatonin receptor type 1A
Name:Melatonin receptor type 1A
Type:Enzyme
Mol. Mass.:39392.94
Organism:Homo sapiens (Human)
Description:P48039
Residue:350
BDBM50049516
NameBDBM50049516
Synonyms:CHEMBL50398 N-[3-(3-Methoxy-phenyl)-propyl]-acetamide
TypeSmall organic molecule
Emp. Form.C12H17NO2
Mol. Mass.207.2689
SMILESCOc1cccc(CCCNC(C)=O)c1