Reaction Details
TargetMelatonin receptor type 1A
LigandBDBM50049554
Substrate/Competitorn/a
Meas. Tech.ChEMBL_624959 (CHEMBL1107082)
Ki 85.4±n/a nM
Citation Hu, YHo, MKChan, KHNew, DCWong, YH Synthesis of substituted N-[3-(3-methoxyphenyl)propyl] amides as highly potent MT(2)-selective melatonin ligands. Bioorg Med Chem Lett20:2582-5 (2010) 
 
Melatonin receptor type 1A
Name:Melatonin receptor type 1A
Type:Enzyme
Mol. Mass.:39392.94
Organism:Homo sapiens (Human)
Description:P48039
Residue:350
BDBM50049554
NameBDBM50049554
Synonyms:CHEMBL297947 N-[3-(3-Methoxy-phenyl)-propyl]-propionamide
TypeSmall organic molecule
Emp. Form.C13H19NO2
Mol. Mass.221.2955
SMILESCCC(=O)NCCCc1cccc(OC)c1