Reaction Details
TargetMelatonin receptor type 1A
LigandBDBM50315180
Substrate/Competitorn/a
Meas. Tech.ChEMBL_624959 (CHEMBL1107082)
Ki 379±n/a nM
Citation Hu, YHo, MKChan, KHNew, DCWong, YH Synthesis of substituted N-[3-(3-methoxyphenyl)propyl] amides as highly potent MT(2)-selective melatonin ligands. Bioorg Med Chem Lett20:2582-5 (2010) 
 
Melatonin receptor type 1A
Name:Melatonin receptor type 1A
Type:Enzyme
Mol. Mass.:39392.94
Organism:Homo sapiens (Human)
Description:P48039
Residue:350
BDBM50315180
NameBDBM50315180
Synonyms:CHEMBL1092062 | N-(3-(2-hydroxy-5-methoxyphenyl)propyl)acetamide
TypeSmall organic molecule
Emp. Form.C12H17NO3
Mol. Mass.223.2683
SMILESCOc1ccc(O)c(CCCNC(C)=O)c1