Reaction Details
TargetHistamine H1 receptor
LigandBDBM50315187
Substrate/Competitorn/a
Meas. Tech.ChEMBL_625162 (CHEMBL1115183)
Ki 2.2±n/a nM
Citation Li, BFMoree, WJYu, JCoon, TZamani-Kord, SMalany, SJalali, KWen, JWang, HYang, CHoare, SRPetroski, REMadan, ACrowe, PDBeaton, G Selectivity profiling of novel indene H(1)-antihistamines for the treatment of insomnia. Bioorg Med Chem Lett20:2629-33 (2010) 
 
Histamine H1 receptor
Name:Histamine H1 receptor
Type:G Protein-Coupled Receptor (GPCR)
Mol. Mass.:55808.72
Organism:Homo sapiens (Human)
Description:Cell pellets from SK-N-MC cells transfected with human H1 receptor were used in binding assay.
Residue:487
BDBM50315187
NameBDBM50315187
Synonyms:2-(3-((3-methoxypyrazin-2-yl)methyl)-1H-inden-2-yl)-N,N-dimethylethanamine | CHEMBL1088900
TypeSmall organic molecule
Emp. Form.C19H23N3O
Mol. Mass.309.4054
SMILESCOc1nccnc1CC1=C(CCN(C)C)Cc2ccccc12