Reaction Details
TargetCatechol O-methyltransferase
LigandBDBM50315221
Substrate/Competitorn/a
Meas. Tech.ChEMBL_625415 (CHEMBL1116964)
Ki 6±n/a nM
Citation Rautio, JLeppänen, JLehtonen, MLaine, KKoskinen, MPystynen, JSavolainen, JSairanen, M Design, synthesis and in vitro/in vivo evaluation of orally bioavailable prodrugs of a catechol-O-methyltransferase inhibitor. Bioorg Med Chem Lett20:2614-6 (2010) 
 
Catechol O-methyltransferase
Name:Catechol O-methyltransferase
Type:Enzyme
Mol. Mass.:30030.67
Organism:Homo sapiens (Human)
Description:P21964
Residue:271
BDBM50315221
NameBDBM50315221
Synonyms:(2-amino-3-methylbutanoyloxy)methyl 3-chloro-5,6-dihydroxy-7-nitrobenzo[b]thiophene-2-carboxylate | CHEMBL1091982
TypeSmall organic molecule
Emp. Form.C15H15ClN2O8S
Mol. Mass.418.806
SMILESCC(C)C(N)C(=O)OCOC(=O)c1sc2c(c(O)c(O)cc2c1Cl)[N+]([O-])=O