Reaction Details
TargetNon-receptor tyrosine-protein kinase TYK2
LigandBDBM50315234
Substrate/Competitorn/a
Meas. Tech.ChEMBL_625437 (CHEMBL1116986)
IC50 439±n/a nM
Citation Pissot-Soldermann, CGerspacher, MFuret, PGaul, CHolzer, PMcCarthy, CRadimerski, TRegnier, CHBaffert, FDrueckes, PTavares, GAVangrevelinghe, EBlasco, FOttaviani, GOssola, FScesa, JReetz, J Discovery and SAR of potent, orally available 2,8-diaryl-quinoxalines as a new class of JAK2 inhibitors. Bioorg Med Chem Lett20:2609-13 (2010) 
 
Non-receptor tyrosine-protein kinase TYK2
Name:Non-receptor tyrosine-protein kinase TYK2
Type:Protein
Mol. Mass.:133666.03
Organism:Homo sapiens (Human)
Description:P29597
Residue:1187
BDBM50315234
NameBDBM50315234
Synonyms:(2-methyl-4-(8-(3-methyl-4-(morpholinomethyl)phenyl)quinoxalin-2-yl)phenyl)(morpholino)methanone | CHEMBL1089815
TypeSmall organic molecule
Emp. Form.C32H34N4O3
Mol. Mass.522.6374
SMILESCc1cc(ccc1CN1CCOCC1)-c1cccc2ncc(nc12)-c1ccc(C(=O)N2CCOCC2)c(C)c1