Reaction Details
TargetTyrosine-protein kinase JAK1
LigandBDBM50315244
Substrate/Competitorn/a
Meas. Tech.ChEMBL_625434 (CHEMBL1116983)
IC50 390±n/a nM
Citation Pissot-Soldermann, CGerspacher, MFuret, PGaul, CHolzer, PMcCarthy, CRadimerski, TRegnier, CHBaffert, FDrueckes, PTavares, GAVangrevelinghe, EBlasco, FOttaviani, GOssola, FScesa, JReetz, J Discovery and SAR of potent, orally available 2,8-diaryl-quinoxalines as a new class of JAK2 inhibitors. Bioorg Med Chem Lett20:2609-13 (2010) 
 
Tyrosine-protein kinase JAK1
Name:Tyrosine-protein kinase JAK1
Type:Protein
Mol. Mass.:133293.73
Organism:Homo sapiens (Human)
Description:P23458
Residue:1154
BDBM50315244
NameBDBM50315244
Synonyms:CHEMBL1091565 | morpholino(4-(3-(3,4,5-trimethoxyphenyl)quinoxalin-5-yl)phenyl)methanone
TypeSmall organic molecule
Emp. Form.C28H27N3O5
Mol. Mass.485.5311
SMILESCOc1cc(cc(OC)c1OC)-c1cnc2cccc(-c3ccc(cc3)C(=O)N3CCOCC3)c2n1