Reaction Details
TargetTyrosine-protein kinase JAK1
LigandBDBM50315238
Substrate/Competitorn/a
Meas. Tech.ChEMBL_625434 (CHEMBL1116983)
IC50 82±n/a nM
Citation Pissot-Soldermann, CGerspacher, MFuret, PGaul, CHolzer, PMcCarthy, CRadimerski, TRegnier, CHBaffert, FDrueckes, PTavares, GAVangrevelinghe, EBlasco, FOttaviani, GOssola, FScesa, JReetz, J Discovery and SAR of potent, orally available 2,8-diaryl-quinoxalines as a new class of JAK2 inhibitors. Bioorg Med Chem Lett20:2609-13 (2010) 
 
Tyrosine-protein kinase JAK1
Name:Tyrosine-protein kinase JAK1
Type:Protein
Mol. Mass.:133293.73
Organism:Homo sapiens (Human)
Description:P23458
Residue:1154
BDBM50315238
NameBDBM50315238
Synonyms:8-[4-(1,1-Dioxo-1lambda*6*-thiomorpholin-4-ylmethyl)-3,5-difluoro-phenyl]-2-[6-(4-methyl-piperazin-1-yl)-pyridin-3-yl]-quinoxaline | CHEMBL1092925
TypeSmall organic molecule
Emp. Form.C29H30F2N6O2S
Mol. Mass.564.649
SMILESCN1CCN(CC1)c1ccc(cn1)-c1cnc2cccc(-c3cc(F)c(CN4CCS(=O)(=O)CC4)c(F)c3)c2n1