Reaction Details
TargetTyrosine-protein kinase JAK3
LigandBDBM50315237
Substrate/Competitorn/a
Meas. Tech.ChEMBL_625436 (CHEMBL1116985)
IC50 166±n/a nM
Citation Pissot-Soldermann, CGerspacher, MFuret, PGaul, CHolzer, PMcCarthy, CRadimerski, TRegnier, CHBaffert, FDrueckes, PTavares, GAVangrevelinghe, EBlasco, FOttaviani, GOssola, FScesa, JReetz, J Discovery and SAR of potent, orally available 2,8-diaryl-quinoxalines as a new class of JAK2 inhibitors. Bioorg Med Chem Lett20:2609-13 (2010) 
 
Tyrosine-protein kinase JAK3
Name:Tyrosine-protein kinase JAK3
Type:Protein
Mol. Mass.:125111.08
Organism:Homo sapiens (Human)
Description:P52333
Residue:1124
BDBM50315237
NameBDBM50315237
Synonyms:4-(2,6-difluoro-4-(3-(4-(4-methylpiperazin-1-yl)phenyl)quinoxalin-5-yl)benzyl)morpholine | CHEMBL1089773
TypeSmall organic molecule
Emp. Form.C30H31F2N5O
Mol. Mass.515.5968
SMILESCN1CCN(CC1)c1ccc(cc1)-c1cnc2cccc(-c3cc(F)c(CN4CCOCC4)c(F)c3)c2n1