Reaction Details
TargetLysosomal acid glucosylceramidase
LigandBDBM50315250
Substrate/Competitorn/a
Meas. Tech.ChEMBL_625475 (CHEMBL1105278)
Ki 2.2±n/a nM
Citation Schönemann, WGallienne, ECompain, PIkeda, KAsano, NMartin, OR Synthesis of new beta-1-C-alkylated imino-L-iditols: A comparative study of their activity as beta-glucocerebrosidase inhibitors. Bioorg Med Chem18:2645-50 (2010) 
 
Lysosomal acid glucosylceramidase
Name:Lysosomal acid glucosylceramidase
Type:Enzyme
Mol. Mass.:59724.64
Organism:Homo sapiens (Human)
Description:The beta-Glu activity was measured with commercially available beta-glucocerebrosidase (Ceredase) as the enzyme source.
Residue:536
BDBM50315250
NameBDBM50315250
Synonyms:(2R,3S,4S,5R)-2-nonylpiperidine-3,4,5-triol | CHEMBL1091214
TypeSmall organic molecule
Emp. Form.C14H29NO3
Mol. Mass.259.385
SMILESCCCCCCCCC[C@H]1NC[C@@H](O)[C@H](O)[C@H]1O