Reaction Details
TargetGonadotropin-releasing hormone receptor
LigandBDBM50258205
Substrate/Competitorn/a
Meas. Tech.ChEMBL_625918 (CHEMBL1115144)
IC50 24±n/a nM
Citation Vera, MDLundquist, JTChengalvala, MVCottom, JEFeingold, IBGarrick, LMGreen, DMHauze, DBMann, CWMehlmann, JFRogers, JFShanno, LWrobel, JEPelletier, JC Synthesis and biological evaluation of piperazinyl heterocyclic antagonists of the gonadotropin releasing hormone (GnRH) receptor. Bioorg Med Chem Lett20:2512-5 (2010) 
 
Gonadotropin-releasing hormone receptor
Name:Gonadotropin-releasing hormone receptor
Type:PROTEIN
Mol. Mass.:37767.60
Organism:Rattus norvegicus
Description:ChEMBL_1335047
Residue:327
BDBM50258205
NameBDBM50258205
Synonyms:2-(4-tert-butylphenyl)-4-(4-((1-ethyl-5-methyl-1H-imidazol-4-yl)methyl)piperazin-1-yl)-1H-benzo[d]imidazole | CHEMBL521674
TypeSmall organic molecule
Emp. Form.C28H36N6
Mol. Mass.456.6256
SMILESCCn1cnc(CN2CCN(CC2)c2cccc3[nH]c(nc23)-c2ccc(cc2)C(C)(C)C)c1C