Reaction Details
TargetGonadotropin-releasing hormone receptor
LigandBDBM50256882
Substrate/Competitorn/a
Meas. Tech.ChEMBL_625920 (CHEMBL1115146)
IC50 28±n/a nM
Citation Vera, MDLundquist, JTChengalvala, MVCottom, JEFeingold, IBGarrick, LMGreen, DMHauze, DBMann, CWMehlmann, JFRogers, JFShanno, LWrobel, JEPelletier, JC Synthesis and biological evaluation of piperazinyl heterocyclic antagonists of the gonadotropin releasing hormone (GnRH) receptor. Bioorg Med Chem Lett20:2512-5 (2010) 
 
Gonadotropin-releasing hormone receptor
Name:Gonadotropin-releasing hormone receptor
Type:Enzyme
Mol. Mass.:37749.45
Organism:Homo sapiens (Human)
Description:P30968
Residue:328
BDBM50256882
NameBDBM50256882
Synonyms:6-((4-(2-(4-tert-butylphenyl)-1H-benzo[d]imidazol-4-yl)piperazin-1-yl)methyl)quinoxaline WAY-207024
TypeSmall organic molecule
Emp. Form.C30H32N6
Mol. Mass.476.6153
SMILESCC(C)(C)c1ccc(cc1)-c1nc2c(cccc2[nH]1)N1CCN(Cc2ccc3nccnc3c2)CC1