Reaction Details
TargetC-X-C chemokine receptor type 4
LigandBDBM50315295
Substrate/Competitorn/a
Meas. Tech.ChEMBL_626229 (CHEMBL1107996)
IC50 68±n/a nM
Citation Skerlj, RTBridger, GJKaller, AMcEachern, EJCrawford, JBZhou, YAtsma, BLangille, JNan, SVeale, DWilson, THarwig, CHatse, SPrincen, KDe Clercq, ESchols, D Discovery of novel small molecule orally bioavailable C-X-C chemokine receptor 4 antagonists that are potent inhibitors of T-tropic (X4) HIV-1 replication. J Med Chem53:3376-88 (2010) 
 
C-X-C chemokine receptor type 4
Name:C-X-C chemokine receptor type 4
Type:Enzyme
Mol. Mass.:39754.61
Organism:Homo sapiens (Human)
Description:P61073
Residue:352
BDBM50315295
NameBDBM50315295
Synonyms:CHEMBL1088912 | N1-(1H-Benzo[d]imidazol-2-ylmethyl)-N1-(5,6,7,8-tetrahydroquinolin-8-yl)propane-1,3-diamine
TypeSmall organic molecule
Emp. Form.C20H25N5
Mol. Mass.335.446
SMILESNCCCN(Cc1nc2ccccc2[nH]1)C1CCCc2cccnc12