Reaction Details
TargetC-C chemokine receptor type 5
LigandBDBM50315305
Substrate/Competitorn/a
Meas. Tech.ChEMBL_626224 (CHEMBL1107991)
IC50>10000±n/a nM
Citation Skerlj, RTBridger, GJKaller, AMcEachern, EJCrawford, JBZhou, YAtsma, BLangille, JNan, SVeale, DWilson, THarwig, CHatse, SPrincen, KDe Clercq, ESchols, D Discovery of novel small molecule orally bioavailable C-X-C chemokine receptor 4 antagonists that are potent inhibitors of T-tropic (X4) HIV-1 replication. J Med Chem53:3376-88 (2010) 
 
C-C chemokine receptor type 5
Name:C-C chemokine receptor type 5
Type:Enzyme
Mol. Mass.:40540.21
Organism:Homo sapiens (Human)
Description:P51681
Residue:352
BDBM50315305
NameBDBM50315305
Synonyms:(S)-N-((1H-benzo[d]imidazol-2-yl)methyl)-N-(4-aminobutyl)-5,6,7,8-tetrahydroquinolin-8-amine CHEMBL518924
TypeSmall organic molecule
Emp. Form.C21H27N5
Mol. Mass.349.4726
SMILESNCCCCN(Cc1nc2ccccc2[nH]1)[C@H]1CCCc2cccnc12