Reaction Details
TargetSolute carrier family 12 member 5
LigandBDBM50315353
Substrate/Competitorn/a
Meas. Tech.ChEMBL_625987 (CHEMBL1103506)
IC50 1000±n/a nM
Citation Pégurier, CBosman, NCollart, PDelporte, MLLeclercq, KLengelé, SKanduluru, AKMeunier, SPacico, NVadali, LRWagner, AWolff, CProvins, L Benzyl prolinate derivatives as novel selective KCC2 blockers. Bioorg Med Chem Lett20:2542-5 (2010) 
 
Solute carrier family 12 member 5
Name:Solute carrier family 12 member 5
Type:PROTEIN
Mol. Mass.:126249.28
Organism:Rattus norvegicus
Description:ChEMBL_818163
Residue:1139
BDBM50315353
NameBDBM50315353
Synonyms:CHEMBL1088881 | benzyl 1-acetyl-2-(cyclohexylmethyl)pyrrolidine-2-carboxylate
TypeSmall organic molecule
Emp. Form.C21H29NO3
Mol. Mass.343.4599
SMILESCC(=O)N1CCCC1(CC1CCCCC1)C(=O)OCc1ccccc1