Reaction Details
TargetSolute carrier family 12 member 5
LigandBDBM50315357
Substrate/Competitorn/a
Meas. Tech.ChEMBL_625987 (CHEMBL1103506)
IC50 400±n/a nM
Citation Pégurier, CBosman, NCollart, PDelporte, MLLeclercq, KLengelé, SKanduluru, AKMeunier, SPacico, NVadali, LRWagner, AWolff, CProvins, L Benzyl prolinate derivatives as novel selective KCC2 blockers. Bioorg Med Chem Lett20:2542-5 (2010) 
 
Solute carrier family 12 member 5
Name:Solute carrier family 12 member 5
Type:PROTEIN
Mol. Mass.:126249.28
Organism:Rattus norvegicus
Description:ChEMBL_818163
Residue:1139
BDBM50315357
NameBDBM50315357
Synonyms:CHEMBL1091212 | benzyl 1-acetyl-2-(4-methoxybenzyl)pyrrolidine-2-carboxylate
TypeSmall organic molecule
Emp. Form.C22H25NO4
Mol. Mass.367.4382
SMILESCOc1ccc(CC2(CCCN2C(C)=O)C(=O)OCc2ccccc2)cc1