Reaction Details
TargetCalcitonin gene-related peptide type 1 receptor
LigandBDBM50315400
Substrate/Competitorn/a
Meas. Tech.ChEMBL_626018 (CHEMBL1106146)
IC50 1.7±n/a nM
Citation Stump, CABell, IMBednar, RAFay, JFGallicchio, SNHershey, JCJelley, RKreatsoulas, CMoore, ELMosser, SDQuigley, AGRoller, SASalvatore, CASharik, SSTheberge, CRZartman, CBKane, SAGraham, SLSelnick, HGVacca, JPWilliams, TM Identification of potent, highly constrained CGRP receptor antagonists. Bioorg Med Chem Lett20:2572-6 (2010) 
 
Calcitonin gene-related peptide type 1 receptor
Name:Calcitonin gene-related peptide type 1 receptor
Type:Enzyme Catalytic Domain
Mol. Mass.:52980.45
Organism:Homo sapiens (Human)
Description:Q16602
Residue:461
BDBM50315400
NameBDBM50315400
Synonyms:(S)-1-((3'-methyl-2',5'-dioxo-6,8-dihydrospiro[cyclopenta[g]quinoline-7,4'-imidazolidine]-2-yl)methyl)-1H-imidazo[1,5,4-de]quinoxaline-2,5(4H,6H)-dione | CHEMBL1090848
TypeSmall organic molecule
Emp. Form.C25H20N6O4
Mol. Mass.468.4641
SMILESCN1C(=O)NC(=O)[C@@]11Cc2cc3ccc(Cn4c5cccc6NC(=O)Cn(c56)c4=O)nc3cc2C1