Reaction Details
TargetCalcitonin gene-related peptide type 1 receptor
LigandBDBM50315405
Substrate/Competitorn/a
Meas. Tech.ChEMBL_626018 (CHEMBL1106146)
IC50 0.86±n/a nM
Citation Stump, CABell, IMBednar, RAFay, JFGallicchio, SNHershey, JCJelley, RKreatsoulas, CMoore, ELMosser, SDQuigley, AGRoller, SASalvatore, CASharik, SSTheberge, CRZartman, CBKane, SAGraham, SLSelnick, HGVacca, JPWilliams, TM Identification of potent, highly constrained CGRP receptor antagonists. Bioorg Med Chem Lett20:2572-6 (2010) 
 
Calcitonin gene-related peptide type 1 receptor
Name:Calcitonin gene-related peptide type 1 receptor
Type:Enzyme Catalytic Domain
Mol. Mass.:52980.45
Organism:Homo sapiens (Human)
Description:Q16602
Residue:461
BDBM50315405
NameBDBM50315405
Synonyms:1-(((R)-2'-oxo-1',2',6,8-tetrahydrospiro[cyclopenta[g]quinoline-7,3'-pyrrolo[2,3-b]pyridine]-2-yl)methyl)-1,2,2a,3-tetrahydropyrrolo[4,3,2-de]quinolin-4(5H)-one | CHEMBL1092837
TypeSmall organic molecule
Emp. Form.C29H23N5O2
Mol. Mass.473.5252
SMILESO=C1Nc2ncccc2[C@]11Cc2cc3ccc(CN4CC5CC(=O)Nc6cccc4c56)nc3cc2C1