Reaction Details
TargetCalcitonin gene-related peptide type 1 receptor
LigandBDBM50315409
Substrate/Competitorn/a
Meas. Tech.ChEMBL_626017 (CHEMBL1106145)
Ki 0.072±n/a nM
Citation Stump, CABell, IMBednar, RAFay, JFGallicchio, SNHershey, JCJelley, RKreatsoulas, CMoore, ELMosser, SDQuigley, AGRoller, SASalvatore, CASharik, SSTheberge, CRZartman, CBKane, SAGraham, SLSelnick, HGVacca, JPWilliams, TM Identification of potent, highly constrained CGRP receptor antagonists. Bioorg Med Chem Lett20:2572-6 (2010) 
 
Calcitonin gene-related peptide type 1 receptor
Name:Calcitonin gene-related peptide type 1 receptor
Type:Enzyme Catalytic Domain
Mol. Mass.:52980.45
Organism:Homo sapiens (Human)
Description:Q16602
Residue:461
BDBM50315409
NameBDBM50315409
Synonyms:2a-ethyl-1-(((R)-2'-oxo-1',2',6,8-tetrahydrospiro[cyclopenta[g]quinoline-7,3'-pyrrolo[2,3-b]pyridine]-2-yl)methyl)-1,2,2a,3-tetrahydropyrrolo[4,3,2-de]quinolin-4(5H)-one | CHEMBL1092208
TypeSmall organic molecule
Emp. Form.C31H27N5O2
Mol. Mass.501.5784
SMILESCCC12CN(Cc3ccc4cc5C[C@]6(Cc5cc4n3)C(=O)Nc3ncccc63)c3cccc(NC(=O)C1)c23